{"text_format":"1","workbook":"xlsx","n_sheets":2,"sheets":["Propiedad Intelectual","DATOS"],"not_rendered":{"charts":0,"images":3,"macros":1,"external_links":0,"defined_names":36,"comments":0,"pivot_tables":0},"unopened":[],"bounds":{"document_bytes":16777216,"sheet_cells":100000,"rows_first":2000,"rows_last":500,"rows_between":2000,"halvings":0,"cell_chars":16384,"cell_head_chars":4096},"cells_cut":0,"cells_raw":0,"read":"whole","date_system":"1900"}

{"sheet":"Propiedad Intelectual","index":0,"n_rows":56,"n_cols":6,"rows_kept":56,"cut":false,"hidden":false,"merged":[[1,1,1,4],[16,1,16,3],[17,1,17,3],[18,1,18,3],[16,4,16,5],[25,1,25,5],[19,1,19,3],[19,4,19,5],[20,1,20,3],[20,4,20,5],[55,0,55,5],[26,1,26,5],[51,1,51,3],[54,0,54,5],[52,0,52,5],[49,0,49,5],[38,0,38,5],[27,0,27,5],[53,0,53,5],[50,1,50,5],[0,0,0,5],[3,0,3,5],[4,1,4,5],[12,0,13,0],[21,1,21,5],[5,1,5,5],[14,1,14,5],[15,1,15,5],[11,0,11,5],[17,4,17,5],[18,4,18,5],[21,0,24,0],[22,1,22,5],[23,1,23,5],[24,1,24,5],[16,0,20,0]]}
["FORMULARIO PARA LA PRESENTACIÓN DE OBRAS"]
["Publicación científica","Escoja una opción:"]
[]
["DATOS DE LA PROPUESTA"]
["Título"]
["Breve resumen de la obra"]
["Número de hojas de la obra (de corresponder)"]
["Impacto que generará la obra"]
["Público objetivo"]
["Estrategias de difusión de la obra a aplicar"]
["Especifique el aporte de la obra a la cátedra o malla curricular de su carrera (bibliografía sílabo)"]
[]
["Marque con una X, según corresponda","Original/\nInédita","Individual","En colaboración","Colectiva\n(liderada por otro)","Compuesta\n(derivada de otra)"]
[]
["Proyecto institucional del que se deriva:"]
["Grupo de investigación institucional:","Seleccione un grupo de investigación:"]
["Líneas de investigación institucionales 2020-2022","LÍNEAS",null,null,"SUBLÍNEAS"]
[null,"Seleccione una línea de investigación:"]
[]
[]
[]
["Campo/s detallado/s de conocimiento (Según Reglamento de armonización de la nomenclatura de títulos profesionales y grados académicos que…)",{"$f":"_xlfn.IFNA(INDEX(DATOS!$G$23:$G$39,DATOS!$M23,1),\"\")","v":""}]
[null,{"$f":"_xlfn.IFNA(INDEX(DATOS!$G$23:$G$39,DATOS!$M24,1),\"\")","v":""}]
[null,{"$f":"_xlfn.IFNA(INDEX(DATOS!$G$23:$G$39,DATOS!$M25,1),\"\")","v":""}]
[null,{"$f":"_xlfn.IFNA(INDEX(DATOS!$G$23:$G$39,DATOS!$M26,1),\"\")","v":""}]
["Pertinencia con la/s carrera/s de:"]
["Observación adicional:"]
["AUTORES INTERNOS (con filiación UNACH)"]
["DATOS PERSONALES","Autor 1","Autor 2","Autor 3","Autor 4","Autor 5"]
["Cédula o Pasaporte"]
["Nombres"]
["Apellidos"]
["Fecha de nacimiento"]
["Dirección domiciliaria"]
["Grado académico más alto","Escoja una opción:"]
["Facultad","Seleccione una facultad:"]
["Carrera/s"]
["Cargo (Docente, estudiante, personal administrativo UNACH)"]
["AUTORES EXTERNOS (sin filiación UNACH)"]
["DATOS PERSONALES","Autor 1","Autor 2","Autor 3","Autor 4","Autor 5"]
["Cédula o Pasaporte"]
["Nombres"]
["Apellidos"]
["Fecha de nacimiento"]
["Dirección domiciliaria"]
["Grado académico más alto","Escoja una opción:"]
["Facultad"]
["Carrera/s"]
["Cargo (Docente, estudiante, etc)"]
["DATOS DEL SOLICITANTE DE LA PROPUESTA"]
["Nombres del solicitante:"]
["Correo electrónico",null,null,null,"Celular:"]
["Declaro y me responsabilizo que toda la información contenida y emitida para este proceso es verídica, y eximo a la Dirección de Investigación de responsabilidad alguna. En caso de que se compruebe la falsedad de la información autorizo a la Institución tomar las acciones legales que correspondan."]
["Firma del solicitante"]
["Correo electrónico de la GCPI: gcpi@unach.edu.ec"]
["http://investigacion.unach.edu.ec"]

{"sheet":"DATOS","index":1,"n_rows":53,"n_cols":21,"rows_kept":53,"cut":false,"hidden":true,"merged":[]}
[null,null,"FACULTADES",null,null,null,"OBRA"]
[null,null,"Seleccione una facultad:",null,null,null,"Escoja una opción:"]
[null,null,"Ciencias_de_la_Educación_Humanas_y_Tecnologías",null,null,null,"LIBRO"]
[null,null,"Ciencias_Políticas_y_Administrativas",null,null,null,"CAPÍTULO DE LIBRO"]
[null,null,"Ingeniería",null,null,null,"PRODUCCIÓN ARTÍSTICA"]
[null,null,"Salud",null,null,null,"PRODUCCIÓN INDUSTRIAL"]
["TÍTULO",null,null,null,null,null,"PATENTE","Ciencias_Políticas_y_Administrativas",null,null,null,"Ingeniería",null,null,"Salud"]
["Escoja una opción:",null,null,null,null,null,"SOFTWARE","Administración de Empresas",null,null,null,"Arquitectura",null,null,"Enfermería"]
["PhD.",null,"Ciencias_de_la_Educación_Humanas_y_Tecnologías",null,null,null,"PROTOTIPO","Comunicación",null,null,null,"Ingeniería Agroindustrial",null,null,"Fisioterapia"]
["Máster",null,"Diseño Gráfico",null,null,null,"CREACIONES U OBTENCIONES VEGETALES","Contabilidad y Auditoría",null,null,null,"Ingeniería Ambiental",null,null,"Laboratorio Clínico"]
["Ingeniero(a)",null,"Educación Básica",null,null,null,null,"Derecho",null,null,null,"Ingeniería Civil",null,null,"Medicina"]
["Abogado(a)",null,"Educación Inicial",null,null,null,null,"Economía",null,null,null,"Ingeniería en Tecnologías de la Información",null,null,"Odontología"]
["Doctor(a) (No PhD)",null,"Pedagogía de la Actividad Física y el Deporte",null,null,null,null,"Turismo",null,null,null,"Ingeniería en Telecomunicaciones",null,null,"Psicología Clínica"]
["Licenciado(a)",null,"Pedagogía de la Historia y las Ciencias Sociales ",null,null,null,null,null,null,null,null,"Ingeniería Industrial"]
["Arquitecto(a)",null,"Pedagogía de la Lengua y la Literatura"]
["Tecnólogo",null,"Pedagogía de las Artes y Humanidades"]
["Técnico",null,"Pedagogía de las Ciencias Experimentales "]
["Estudiante",null,"Pedagogía de los Idiomas Nacionales y Extranjeros"]
[null,null,"Psicopedagogía"]
[]
["GRUPOS DE INVESTIGACIÓN",null,null,null,null,null,null,"LÍNEAS DE INVESTIGACIÓN",null,null,null,null,null,null,"LÍNEAS DE INVESTIGACIÓN CON SUBLÍNEAS"]
["Seleccione un grupo de investigación:",null,null,null,null,null,"ÁREA DEL CONOCIMIENTO","Seleccione una línea de investigación:",null,null,null,null,null,null,"CIENCIAS_SOCIALES_Y_DEL_COMPORTAMIENTO",null,null,null,null,"INGENIERÍA_INFORMÁTICA"]
["Actividad física, salud y deporte",null,null,null,null,null,"Educación","CIENCIAS_DE_LA_EDUCACIÓN_Y_FORMACIÓN_PROFESIONAL_O_NO_PROFESIONAL",null,null,null,null,{"$f":"MATCH(LINEA1,DATOS!$H$23:$H$39,0)","v":{"$error":"#N/A"}},null,"ECONOMÍA DEL DESARROLLO",null,null,null,null,"MODELADO Y SIMULACIÓN DE SISTEMAS"]
["Análisis contable, tributario y de auditoría para el desarrollo económico y social",null,null,null,null,null,"Ciencias naturales, matemáticas y estadística","CIENCIAS_DE_LA_VIDA",null,null,null,null,{"$f":"MATCH(LINEA2,DATOS!$H$23:$H$39,0)","v":{"$error":"#N/A"}},null,"EMPRENDIMIENTO INNOVACIÓN Y DESARROLLO EMPRESARIAL"]
["Análisis de muestras biológicas y forenses",null,null,null,null,null,"Ciencias sociales, periodismo, información y derecho","CIENCIAS_SOCIALES_Y_DEL_COMPORTAMIENTO",null,null,null,null,{"$f":"MATCH(LINEA3,DATOS!$H$23:$H$39,0)","v":{"$error":"#N/A"}},null,"POLITICA ECONOMICA"]
["Ciudades sostenibles intermedias",null,null,null,null,null,"Ciencias sociales, periodismo, información y derecho","COMUNICACIÓN_Y_CULTURA",null,null,null,null,{"$f":"MATCH(LINEA4,DATOS!$H$23:$H$39,0)","v":{"$error":"#N/A"}}]
["Clean energy and environment",null,null,null,null,null,"Artes y humanidades","CULTURA_VISUAL"]
["Cuidados en procesos vitales",null,null,null,null,null,"Ciencias sociales, periodismo, información y derecho","DERECHOS_Y_GARANTIAS_CONSTITUCIONALES"]
["Currículo, procesos, actores y ambientes educativos",null,null,null,null,null,"Ingeniería, industria y construcción","ELECTRÓNICA_TELECOMUNICACIONES_Y_REDES"]
["Desarrollo local y organizacional (DELO)",null,null,null,null,null,"Ciencias sociales, periodismo, información y derecho","GESTIÓN_SOCIOECONÓMICA_CONTABLE_TRIBUTARIA_Y_LABORAL",null,null,null,null,null,null,"INGENIERÍA_CONSTRUCCIÓN_INDUSTRIA_Y_PRODUCCIÓN",null,null,null,null,"MEDIOAMBIENTE_Y_BIODIVERSIDAD"]
["Diseño y cultura visual",null,null,null,null,null,"Ingeniería, industria y construcción","INGENIERÍA_CONSTRUCCIÓN_INDUSTRIA_Y_PRODUCCIÓN",null,null,null,null,null,null,"ARQUITECTURA Y CONSTRUCCIÓN",null,null,null,null,"CALIDAD DEL SUELO"]
["ECOAPLYD",null,null,null,null,null,"Tecnología de la información y la comunicación (tic)","INGENIERÍA_INFORMÁTICA",null,null,null,null,null,null,"PRODUCTIVIDAD Y PROYECTOS DE INFRAESTRUCTURA"]
["Estudios económicos y empresariales para el desarrollo territorial ",null,null,null,null,null,"Ciencias naturales, matemáticas y estadística","MEDIOAMBIENTE_Y_BIODIVERSIDAD"]
["Garantías constitucionales y derechos humanos",null,null,null,null,null,"Patrimonio y saberes ancestrales","PATRIMONIO_Y_SABERES_ANCESTRALES"]
["GESTALT",null,null,null,null,null,"Salud y bienestar","SALUD."]
["Gestión y desarrollo de turismo",null,null,null,null,null,"Servicios","SERVICIOS_PERSONALES",null,null,null,null,null,null,"SALUD."]
["Grupo CIEA",null,null,null,null,null,"Salud y bienestar","SERVICIOS_SOCIALES",null,null,null,null,null,null,"ATENCIÓN INTEGRAL DE SALUD INDIVIDUAL FAMILIAR COMUNITARIA E INTERCULTURAL"]
["Investigación vegetal agroindustrial",null,null,null,null,null,"Ingeniería, industria y construcción","SISTEMAS_DE_PRODUCCIÓN_Y_DESARROLLO_AGROINDUSTRIAL",null,null,null,null,null,null,"SALUD PÚBLICA"]
["Medios y artes narrativas e interactivas, convergencias y emergencias en comunicación y cultura digital y educativa I+D+C+i",null,null,null,null,null,"Tecnología de la información y la comunicación (tic)","TICS_EN_LA_EDUCACIÓN"]
["ModSim, investigaciones de modelamiento y simulación",null,null,null,null,null,null,null,null,null,null,null,null,null,"CIENCIAS_DE_LA_EDUCACIÓN_Y_FORMACIÓN_PROFESIONAL_O_NO_PROFESIONAL",null,null,null,null,null,"CULTURA_VISUAL"]
["Neurociencias",null,null,null,null,null,null,null,null,null,null,null,null,null,"No hay sublíneas",null,null,null,null,null,"No hay sublíneas"]
["Neuropsicopedagogía",null,null,null,null,null,null,null,null,null,null,null,null,null,"CIENCIAS_DE_LA_VIDA",null,null,null,null,null,"DERECHOS_Y_GARANTIAS_CONSTITUCIONALES"]
["Producción animal e industrialización",null,null,null,null,null,null,null,null,null,null,null,null,null,"No hay sublíneas",null,null,null,null,null,"No hay sublíneas"]
["Psicología y salud mental",null,null,null,null,null,null,null,null,null,null,null,null,null,"COMUNICACIÓN_Y_CULTURA",null,null,null,null,null,"ELECTRÓNICA_TELECOMUNICACIONES_Y_REDES"]
["Puruhá, arqueología e historia de la nacionalidad Puruhá hasta la actualidad",null,null,null,null,null,null,null,null,null,null,null,null,null,"No hay sublíneas",null,null,null,null,null,"No hay sublíneas"]
["Radiación electromagnética, sistemas electrónicos aplicados y redes de comunicaicones híbridas (g-research))",null,null,null,null,null,null,null,null,null,null,null,null,null,"GESTIÓN_SOCIOECONÓMICA_CONTABLE_TRIBUTARIA_Y_LABORAL",null,null,null,null,null,"PATRIMONIO_Y_SABERES_ANCESTRALES"]
["Razonamiento crítico, filosofía, historia y teoria social",null,null,null,null,null,null,null,null,null,null,null,null,null,"No hay sublíneas",null,null,null,null,null,"No hay sublíneas"]
["Salud integral",null,null,null,null,null,null,null,null,null,null,null,null,null,"SERVICIOS_PERSONALES",null,null,null,null,null,"SERVICIOS_SOCIALES"]
["Salud pública",null,null,null,null,null,null,null,null,null,null,null,null,null,"No hay sublíneas",null,null,null,null,null,"No hay sublíneas"]
["Telecomunicaciones, informática, industria y construcción (TEIIC)",null,null,null,null,null,null,null,null,null,null,null,null,null,null,null,null,null,null,null,"SISTEMAS_DE_PRODUCCIÓN_Y_DESARROLLO_AGROINDUSTRIAL"]
["Telemedicina y educación médica",null,null,null,null,null,null,null,null,null,null,null,null,null,null,null,null,null,null,null,"No hay sublíneas"]
["Transtornos del metabolismo y de la nutrición",null,null,null,null,null,null,null,null,null,null,null,null,null,"TICS_EN_LA_EDUCACIÓN"]
["Umayuku",null,null,null,null,null,null,null,null,null,null,null,null,null,"No hay sublíneas"]